Target
Free fatty acid receptor 3
Ligand
BDBM50107303
Substrate
Meas. Tech.
ChEMBL_1508992 (CHEMBL3602372)
EC50
>10000±n/a nM
Citation
 Zahanich, IKondratov, INaumchyk, VKheylik, YPlatonov, MZozulya, SKrasavin, M Phenoxymethyl 1,3-oxazoles and 1,2,4-oxadiazoles as potent and selective agonists of free fatty acid receptor 1 (GPR40). Bioorg Med Chem Lett 25:3105-11 (2015)  
Target
Name:
Free fatty acid receptor 3
Synonyms:
FFAR3 GPR41
Type:
PROTEIN
Mol. Mass.:
38655.15
Organism:
Homo sapiens (Human)
Description:
ChEMBL_1508992
Residue:
346
  
Inhibitor
Name:
BDBM50107303
Synonyms:
CHEMBL3601003
Type:
Small organic molecule
Emp. Form.:
C18H15ClN2O4
Mol. Mass.:
358.776
SMILES:
OC(=O)CCc1ccc(OCc2nc(no2)-c2ccc(Cl)cc2)cc1
: