Target
Alpha-1A adrenergic receptor
Ligand
BDBM50108089
Substrate
Meas. Tech.
ChEMBL_1509434 (CHEMBL3603442)
EC50
>10000±n/a nM
Citation
 Wada, YShirahashi, HIwanami, TOgawa, MNakano, SMorimoto, AKasahara, KTanaka, ETakada, YOhashi, SMori, MShuto, S Discovery of Novel Indazole Derivatives as Highly Potent and Selective Humanß3-Adrenergic Receptor Agonists with the Possibility of Having No Cardiovascular Side Effects. J Med Chem 58:6048-57 (2015)  
Target
Name:
Alpha-1A adrenergic receptor
Synonyms:
ADA1A_HUMAN ADRA1C Alpha 1A-adrenoceptor Alpha adrenergic receptor 1a Alpha-adrenergic receptor 1c adrenergic Alpha1 | adrenergic Alpha1C
Type:
Cell-surface receptors
Mol. Mass.:
51511.67
Organism:
Homo sapiens (Human)
Description:
P35348
Residue:
466
  
Inhibitor
Name:
BDBM50108089
Synonyms:
CHEMBL3601306
Type:
Small organic molecule
Emp. Form.:
C22H30N4O4S
Mol. Mass.:
446.563
SMILES:
CC(C)(C)c1n[nH]c2cc(OCCNC[C@H](O)c3cccc(NS(C)(=O)=O)c3)ccc12
: