Target
Beta-3 adrenergic receptor
Ligand
BDBM25392
Substrate
Meas. Tech.
ChEMBL_1509426 (CHEMBL3603434)
EC50
86±n/a nM
Citation
 Wada, YShirahashi, HIwanami, TOgawa, MNakano, SMorimoto, AKasahara, KTanaka, ETakada, YOhashi, SMori, MShuto, S Discovery of Novel Indazole Derivatives as Highly Potent and Selective Humanß3-Adrenergic Receptor Agonists with the Possibility of Having No Cardiovascular Side Effects. J Med Chem 58:6048-57 (2015)  
Target
Name:
Beta-3 adrenergic receptor
Synonyms:
ADRB3 ADRB3_HUMAN Beta-2 adrenergic receptor and beta-3 adrenergic receptor Beta-3 adrenoreceptor | adrenergic Beta3
Type:
G Protein-Coupled Receptor (GPCR)
Mol. Mass.:
43534.88
Organism:
Homo sapiens (Human)
Description:
Residue:
408
  
Inhibitor
Name:
BDBM25392
Synonyms:
4-[1-hydroxy-2-(isopropylamino)ethyl]pyrocatechol;hydrochloride 4-{1-hydroxy-2-[(propan-2-yl)amino]ethyl}benzene-1,2-diol, 2 ISOPROTERONOL Isoproterenol Isoproterenol,(+) Norisodrine | Novodrin
Type:
Small organic molecule
Emp. Form.:
C11H17NO3
Mol. Mass.:
211.2576
SMILES:
CC(C)NCC(O)c1ccc(O)c(O)c1
: