Target
Adenosine receptor A2a
Ligand
BDBM50108679
Substrate
Meas. Tech.
ChEMBL_1506709 (CHEMBL3598725)
Ki
5.2±n/a nM
Citation
 Deng, QLim, YHAnand, RYu, YKim, JHZhou, WZheng, JTempest, PLevorse, DZhang, XGreene, SMullins, DCulberson, CSherborne, BParker, EMStamford, AAli, A Use of molecular modeling aided design to dial out hERG liability in adenosine A(2A) receptor antagonists. Bioorg Med Chem Lett 25:2958-62 (2015)  
Target
Name:
Adenosine receptor A2a
Synonyms:
A2A adenosine receptor (hA2A) ADENOSINE A2 ADORA2 Adenosine A2A receptor (A2AAR)
Type:
G Protein-Coupled Receptor (GPCR)
Mol. Mass.:
44716.46
Organism:
Homo sapiens (Human)
Description:
P29274
Residue:
412
  
Inhibitor
Name:
BDBM50108679
Synonyms:
CHEMBL3596518
Type:
Small organic molecule
Emp. Form.:
C18H20ClN9OS
Mol. Mass.:
445.929
SMILES:
COc1cccc2c3nc(CN4CCN(C[C@H]4C)c4nsnc4Cl)nn3c(N)nc12
: