Target
Thyrotropin-releasing hormone receptor
Ligand
BDBM50109041
Substrate
Meas. Tech.
ChEMBL_1508580 (CHEMBL3602663)
IC50
>50000±n/a nM
Citation
 Meena, CLThakur, ANandekar, PPSangamwar, ATSharma, SSJain, R Synthesis of CNS active thyrotropin-releasing hormone (TRH)-like peptides: Biological evaluation and effect on cognitive impairment induced by cerebral ischemia in mice. Bioorg Med Chem 23:5641-53 (2015)  
Target
Name:
Thyrotropin-releasing hormone receptor
Synonyms:
TRH-R2 | Thyrotropin-releasing hormone receptor 2
Type:
PROTEIN
Mol. Mass.:
27545.04
Organism:
Mus musculus
Description:
ChEMBL_109850
Residue:
251
  
Inhibitor
Name:
BDBM50109041
Synonyms:
CHEMBL3601781
Type:
Small organic molecule
Emp. Form.:
C17H20BrN7O3
Mol. Mass.:
450.29
SMILES:
Cc1cnc(cn1)C(=O)N[C@@H](Cc1nc[nH]c1Br)C(=O)N1CCC[C@H]1C(N)=O
: