Target
Peroxisome proliferator-activated receptor alpha
Ligand
BDBM50109196
Substrate
Meas. Tech.
ChEMBL_1508903 (CHEMBL3602053)
EC50
>100000±n/a nM
Citation
 Fresno, NMacías-González, MTorres-Zaguirre, ARomero-Cuevas, MSanz-Camacho, PElguero, JPavón, FJRodríguez de Fonseca, FGoya, PPérez-Fernández, R Novel Oxazolidinone-Based Peroxisome Proliferator Activated Receptor Agonists: Molecular Modeling, Synthesis, and Biological Evaluation. J Med Chem 58:6639-52 (2015)  
Target
Name:
Peroxisome proliferator-activated receptor alpha
Synonyms:
NR1C1 PPAR PPAR-alpha PPARA_HUMAN Peroxisome proliferator-activated receptor | Peroxisome proliferator-activated receptor alpha (PPAR alpha)
Type:
Enzyme
Mol. Mass.:
52222.08
Organism:
Homo sapiens (Human)
Description:
Q07869
Residue:
468
  
Inhibitor
Name:
BDBM50109196
Synonyms:
CHEMBL3601092
Type:
Small organic molecule
Emp. Form.:
C32H35N3O4
Mol. Mass.:
525.638
SMILES:
O=C(NCC1CCCCC1)c1ccc(NC(=O)c2cccc(CN3[C@H](Cc4ccccc4)COC3=O)c2)cc1
: