Target
Tyrosine-protein kinase JAK3
Ligand
BDBM50109521
Substrate
Meas. Tech.
ChEMBL_1509383 (CHEMBL3603326)
IC50
17±n/a nM
Citation
 Tan, LAkahane, KMcNally, RReyskens, KMFicarro, SBLiu, SHerter-Sprie, GSKoyama, SPattison, MJLabella, KJohannessen, LAkbay, EAWong, KKFrank, DAMarto, JALook, TAArthur, JSEck, MJGray, NS Development of Selective Covalent Janus Kinase 3 Inhibitors. J Med Chem 58:6589-606 (2015)  
Target
Name:
Tyrosine-protein kinase JAK3
Synonyms:
JAK-3 JAK3_HUMAN Janus kinase 3 (JAK3) L-JAK | Leukocyte janus kinase
Type:
Protein
Mol. Mass.:
125111.08
Organism:
Homo sapiens (Human)
Description:
P52333
Residue:
1124
  
Inhibitor
Name:
BDBM50109521
Synonyms:
CHEMBL3601725
Type:
Small organic molecule
Emp. Form.:
C29H33N7O2
Mol. Mass.:
511.618
SMILES:
CN1CCN(CC1)c1ccc(Nc2ncc3c(n2)N(Cc2cccc(NC(=O)C=C)c2)C(=O)C3(C)C)cc1
: