Target
Non-receptor tyrosine-protein kinase TYK2
Ligand
BDBM50109532
Substrate
Meas. Tech.
ChEMBL_1509377 (CHEMBL3603320)
IC50
>10000±n/a nM
Citation
 Tan, LAkahane, KMcNally, RReyskens, KMFicarro, SBLiu, SHerter-Sprie, GSKoyama, SPattison, MJLabella, KJohannessen, LAkbay, EAWong, KKFrank, DAMarto, JALook, TAArthur, JSEck, MJGray, NS Development of Selective Covalent Janus Kinase 3 Inhibitors. J Med Chem 58:6589-606 (2015)  
Target
Name:
Non-receptor tyrosine-protein kinase TYK2
Synonyms:
Non-receptor tyrosine-protein kinase TYK2 (TYK2) TYK2_HUMAN | Tyrosine-protein kinase TYK2
Type:
Protein
Mol. Mass.:
133666.03
Organism:
Homo sapiens (Human)
Description:
P29597
Residue:
1187
  
Inhibitor
Name:
BDBM50109532
Synonyms:
CHEMBL3601223
Type:
Small organic molecule
Emp. Form.:
C26H30ClN7O2
Mol. Mass.:
508.015
SMILES:
COc1cc(ccc1Nc1ncc(Cl)c(NCc2cccc(NC(=O)C=C)c2)n1)N1CCN(C)CC1
: