Target
Tyrosine-protein kinase JAK1
Ligand
BDBM50109532
Substrate
Meas. Tech.
ChEMBL_1509375 (CHEMBL3603318)
IC50
896±n/a nM
Citation
 Tan, LAkahane, KMcNally, RReyskens, KMFicarro, SBLiu, SHerter-Sprie, GSKoyama, SPattison, MJLabella, KJohannessen, LAkbay, EAWong, KKFrank, DAMarto, JALook, TAArthur, JSEck, MJGray, NS Development of Selective Covalent Janus Kinase 3 Inhibitors. J Med Chem 58:6589-606 (2015)  
Target
Name:
Tyrosine-protein kinase JAK1
Synonyms:
JAK-1 JAK1A JAK1_HUMAN Janus kinase 1 (JAK1) | Janus kinase 1 JAK1
Type:
Protein
Mol. Mass.:
133293.73
Organism:
Homo sapiens (Human)
Description:
P23458
Residue:
1154
  
Inhibitor
Name:
BDBM50109532
Synonyms:
CHEMBL3601223
Type:
Small organic molecule
Emp. Form.:
C26H30ClN7O2
Mol. Mass.:
508.015
SMILES:
COc1cc(ccc1Nc1ncc(Cl)c(NCc2cccc(NC(=O)C=C)c2)n1)N1CCN(C)CC1
: