Target
Dual specificity protein kinase TTK
Ligand
BDBM50109530
Substrate
Meas. Tech.
ChEMBL_1509368 (CHEMBL3603311)
IC50
355±n/a nM
Citation
 Tan, LAkahane, KMcNally, RReyskens, KMFicarro, SBLiu, SHerter-Sprie, GSKoyama, SPattison, MJLabella, KJohannessen, LAkbay, EAWong, KKFrank, DAMarto, JALook, TAArthur, JSEck, MJGray, NS Development of Selective Covalent Janus Kinase 3 Inhibitors. J Med Chem 58:6589-606 (2015)  
Target
Name:
Dual specificity protein kinase TTK
Synonyms:
Dual specificity protein kinase (TTK) MPS1 Monopolar Spindle 1 (MPS1) Monopolar Spindle 1 Kinase (MPS1) TTK | TTK_HUMAN
Type:
Protein
Mol. Mass.:
97086.79
Organism:
Homo sapiens (Human)
Description:
P33981
Residue:
857
  
Inhibitor
Name:
BDBM50109530
Synonyms:
CHEMBL3601235
Type:
Small organic molecule
Emp. Form.:
C24H23ClF2N6O2
Mol. Mass.:
500.928
SMILES:
Fc1cc(Nc2ncc(Cl)c(NCc3cccc(NC(=O)C=C)c3)n2)cc(F)c1N1CCOCC1
: