Target
Polyunsaturated fatty acid lipoxygenase ALOX15
Ligand
BDBM50109746
Substrate
Meas. Tech.
ChEMBL_1509999 (CHEMBL3608052)
IC50
13±n/a nM
Citation
 Pelcman, BSanin, ANilsson, PNo, KSchaal, WÖhrman, SKrog-Jensen, CForsell, PHallberg, ALarhed, MBoesen, TKromann, HVogensen, SBGroth, TClaesson, HE 3-Substituted pyrazoles and 4-substituted triazoles as inhibitors of human 15-lipoxygenase-1. Bioorg Med Chem Lett 25:3024-9 (2015)  
Target
Name:
Polyunsaturated fatty acid lipoxygenase ALOX15
Synonyms:
15-Lipoxygenase-1 (15-LOX-1) Arachidonate 15-lipoxygenase LOG15 Reticulocyte 15-lipoxygenase-1 | Sphingosine 1-phosphate receptor 1 (S1P1)
Type:
Protein
Mol. Mass.:
74804.05
Organism:
Homo sapiens (Human)
Description:
Residue:
662
  
Inhibitor
Name:
BDBM50109746
Synonyms:
CHEMBL3604180
Type:
Small organic molecule
Emp. Form.:
C10H6ClN3O
Mol. Mass.:
219.627
SMILES:
Clc1ccc2nc(oc2c1)-c1cc[nH]n1
: