Target
Polyunsaturated fatty acid lipoxygenase ALOX15
Ligand
BDBM50109751
Substrate
Meas. Tech.
ChEMBL_1509997 (CHEMBL3608050)
IC50
4.0±n/a nM
Citation
 Pelcman, BSanin, ANilsson, PNo, KSchaal, WÖhrman, SKrog-Jensen, CForsell, PHallberg, ALarhed, MBoesen, TKromann, HVogensen, SBGroth, TClaesson, HE 3-Substituted pyrazoles and 4-substituted triazoles as inhibitors of human 15-lipoxygenase-1. Bioorg Med Chem Lett 25:3024-9 (2015)  
Target
Name:
Polyunsaturated fatty acid lipoxygenase ALOX15
Synonyms:
15-Lipoxygenase-1 (15-LOX-1) Arachidonate 15-lipoxygenase LOG15 Reticulocyte 15-lipoxygenase-1 | Sphingosine 1-phosphate receptor 1 (S1P1)
Type:
Protein
Mol. Mass.:
74804.05
Organism:
Homo sapiens (Human)
Description:
Residue:
662
  
Inhibitor
Name:
BDBM50109751
Synonyms:
CHEMBL3604184
Type:
Small organic molecule
Emp. Form.:
C10H5Cl2N3O
Mol. Mass.:
254.072
SMILES:
Clc1cc(n[nH]1)-c1nc2ccc(Cl)cc2o1
: