Target
Ribosomal protein S6 kinase alpha-3
Ligand
BDBM50111391
Substrate
Meas. Tech.
ChEMBL_1509948 (CHEMBL3607766)
EC50
1100±n/a nM
Citation
 Jain, RMathur, MLan, JCostales, AAtallah, GRamurthy, SSubramanian, SSetti, LFeucht, PWarne, BDoyle, LBasham, SJefferson, ABLindvall, MAppleton, BAShafer, CM Discovery of Potent and Selective RSK Inhibitors as Biological Probes. J Med Chem 58:6766-83 (2015)  
Target
Name:
Ribosomal protein S6 kinase alpha-3
Synonyms:
90 kDa ribosomal protein S6 kinase 3 MAP kinase-activated protein kinase 1b MAPKAP kinase 1b Mapkapk1b RSK-2 Ribosomal protein S6 kinase alpha-3 Rps6ka3 S6K-alpha-3 p90RSK3 | pp90RSK2
Type:
PROTEIN
Mol. Mass.:
83697.95
Organism:
Mus musculus
Description:
ChEMBL_108393
Residue:
740
  
Inhibitor
Name:
BDBM50111391
Synonyms:
CHEMBL3604787
Type:
Small organic molecule
Emp. Form.:
C22H21F2N3O
Mol. Mass.:
381.4184
SMILES:
CN1CCN(CC1)c1cccc(c1)-c1ccncc1-c1cc(F)c(O)c(F)c1
: