Target
Serine/threonine-protein kinase ULK1
Ligand
BDBM50111573
Substrate
Meas. Tech.
ChEMBL_1510275 (CHEMBL3606871)
IC50
120±n/a nM
Citation
 Lazarus, MBShokat, KM Discovery and structure of a new inhibitor scaffold of the autophagy initiating kinase ULK1. Bioorg Med Chem 23:5483-8 (2015)  
Target
Name:
Serine/threonine-protein kinase ULK1
Synonyms:
ATG1 KIAA0722 ULK1_HUMAN hATG1
Type:
PROTEIN
Mol. Mass.:
112661.80
Organism:
Homo sapiens (Human)
Description:
ChEMBL_1510275
Residue:
1050
  
Inhibitor
Name:
BDBM50111573
Synonyms:
CHEMBL3605056
Type:
Small organic molecule
Emp. Form.:
C18H24IN7O
Mol. Mass.:
481.3339
SMILES:
NCCCNc1nc(Nc2cccc(NC(=O)N3CCCC3)c2)ncc1I
: