Target
Serine/threonine-protein kinase ULK1
Ligand
BDBM17051
Substrate
Meas. Tech.
ChEMBL_1510275 (CHEMBL3606871)
IC50
87±n/a nM
Citation
 Lazarus, MBShokat, KM Discovery and structure of a new inhibitor scaffold of the autophagy initiating kinase ULK1. Bioorg Med Chem 23:5483-8 (2015)  
Target
Name:
Serine/threonine-protein kinase ULK1
Synonyms:
ATG1 KIAA0722 ULK1_HUMAN hATG1
Type:
PROTEIN
Mol. Mass.:
112661.80
Organism:
Homo sapiens (Human)
Description:
ChEMBL_1510275
Residue:
1050
  
Inhibitor
Name:
BDBM17051
Synonyms:
BX-795 N-(3-{[5-iodo-4-({3-[(thiophen-2-ylcarbonyl)amino]propyl}amino)pyrimidin-2-yl]amino}phenyl)pyrrolidine-1-carboxamide | N-{3-[(5-iodo-4-{[3-(thiophen-2-ylformamido)propyl]amino}pyrimidin-2-yl)amino]phenyl}pyrrolidine-1-carboxamide
Type:
Small organic molecule
Emp. Form.:
C23H26IN7O2S
Mol. Mass.:
591.468
SMILES:
Ic1cnc(Nc2cccc(NC(=O)N3CCCC3)c2)nc1NCCCNC(=O)c1cccs1
: