Target
Acetylcholinesterase
Ligand
BDBM50111775
Substrate
Meas. Tech.
ChEMBL_1510666 (CHEMBL3608117)
IC50
0.640000±n/a nM
Citation
 Otto, RPenzis, RGaube, FAdolph, OFöhr, KJWarncke, PRobaa, DAppenroth, DFleck, CEnzensperger, CLehmann, JWinckler, T Evaluation of Homobivalent Carbolines as Designed Multiple Ligands for the Treatment of Neurodegenerative Disorders. J Med Chem 58:6710-5 (2015)  
Target
Name:
Acetylcholinesterase
Synonyms:
ACES_ELEEL Acetylcholinesterase (EeAChE) | ache
Type:
Enzyme
Mol. Mass.:
71812.79
Organism:
Electrophorus electricus (Electric eel)
Description:
Residue:
633
  
Inhibitor
Name:
BDBM50111775
Synonyms:
CHEMBL3605360
Type:
Small organic molecule
Emp. Form.:
C32H36I2N4
Mol. Mass.:
730.464
SMILES:
[I-].[I-].C[n+]1ccc2n(CCCCCCCCn3c4ccccc4c4c[n+](C)ccc34)c3ccccc3c2c1
: