Target
Serine/threonine-protein kinase PAK 1
Ligand
BDBM50112351
Substrate
Meas. Tech.
ChEMBL_1513224 (CHEMBL3610932)
IC50
323±n/a nM
Citation
 Karpov, ASAmiri, PBellamacina, CBellance, MHBreitenstein, WDaniel, DDenay, RFabbro, DFernandez, CGaluba, IGuerro-Lagasse, SGutmann, SHinh, LJahnke, WKlopp, JLai, ALindvall, MKMa, SMöbitz, HPecchi, SRummel, GShoemaker, KTrappe, JVoliva, CCowan-Jacob, SWMarzinzik, AL Optimization of a Dibenzodiazepine Hit to a Potent and Selective Allosteric PAK1 Inhibitor. ACS Med Chem Lett 6:776-81 (2015)  
Target
Name:
Serine/threonine-protein kinase PAK 1
Synonyms:
2.7.11.1 Cell division control protein 42 homolog PAK-1 PAK1_HUMAN p21-activated kinase 1 | p65-PAK
Type:
Mol. Mass.:
60640.15
Organism:
Homo sapiens (Human)
Description:
Q13153
Residue:
545
  
Inhibitor
Name:
BDBM50112351
Synonyms:
CHEMBL3609330
Type:
Small organic molecule
Emp. Form.:
C20H22ClFN4
Mol. Mass.:
372.867
SMILES:
CCN1c2ccc(F)cc2N=C(N2CCN(C)CC2)c2cc(Cl)ccc12
: