Target
Cytochrome P450 1B1
Ligand
BDBM50432672
Substrate
Meas. Tech.
ChEMBL_1508788 (CHEMBL3603197)
Ki
5.6±n/a nM
Citation
 Liu, JPham, PTSkripnikova, EVZheng, SLovings, LJWang, YGoyal, NBellow, SMMensah, LMChatters, AJBratton, MRWiese, TEZhao, MWang, GForoozesh, M A Ligand-Based Drug Design. Discovery of 4-Trifluoromethyl-7,8-pyranocoumarin as a Selective Inhibitor of Human Cytochrome P450 1A2. J Med Chem 58:6481-93 (2015)  
Target
Name:
Cytochrome P450 1B1
Synonyms:
CP1B1_HUMAN CYPIB1 | Cytochrome P450 1B1 (CYP1B1)
Type:
PROTEIN
Mol. Mass.:
60861.81
Organism:
Homo sapiens (Human)
Description:
ChEMBL_1474523
Residue:
543
  
Inhibitor
Name:
BDBM50432672
Synonyms:
CHEMBL2347912
Type:
Small organic molecule
Emp. Form.:
C18H12O4
Mol. Mass.:
292.2855
SMILES:
Oc1cc2OCC=Cc2c2oc(cc(=O)c12)-c1ccccc1
: