Target
cAMP-specific 3',5'-cyclic phosphodiesterase 4D
Ligand
BDBM50108504
Substrate
Meas. Tech.
ChEMBL_1511011 (CHEMBL3607152)
IC50
1.5±n/a nM
Citation
 Press, NJTaylor, RJFullerton, JDTranter, PMcCarthy, CKeller, THArnold, NBeer, DBrown, LCheung, RChristie, JDenholm, AHaberthuer, SHatto, JDKeenan, MMercer, MKOakman, HSahri, HTuffnell, ARTweed, MTrifilieff, A Discovery and Optimization of 4-(8-(3-Fluorophenyl)-1,7-naphthyridin-6-yl)transcyclohexanecarboxylic Acid, an Improved PDE4 Inhibitor for the Treatment of Chronic Obstructive Pulmonary Disease (COPD). J Med Chem 58:6747-52 (2015)  
Target
Name:
cAMP-specific 3',5'-cyclic phosphodiesterase 4D
Synonyms:
3',5'-cyclic phosphodiesterase PDE43 PDE4D_HUMAN | Phosphodiesterase 4D
Type:
Protein
Mol. Mass.:
91092.69
Organism:
Homo sapiens (Human)
Description:
Q08499
Residue:
809
  
Inhibitor
Name:
BDBM50108504
Synonyms:
4-(8-(benzo[c][1,2,5]oxadiazol-5-yl)-1,7-naphthyridin-6-yl)benzoic acid CHEMBL77826
Type:
Small organic molecule
Emp. Form.:
C21H12N4O3
Mol. Mass.:
368.345
SMILES:
OC(=O)c1ccc(cc1)-c1cc2cccnc2c(n1)-c1ccc2nonc2c1
: