Target
Sodium-dependent dopamine transporter
Ligand
BDBM50114074
Substrate
Meas. Tech.
ChEMBL_1511134 (CHEMBL3607547)
EC50
276±n/a nM
Citation
 Del Bello, FSakloth, FPartilla, JSBaumann, MHGlennon, RA Ethylenedioxy homologs of N-methyl-(3,4-methylenedioxyphenyl)-2-aminopropane (MDMA) and its corresponding cathinone analog methylenedioxymethcathinone: Interactions with transporters for serotonin, dopamine, and norepinephrine. Bioorg Med Chem 23:5574-9 (2015)  
Target
Name:
Sodium-dependent dopamine transporter
Synonyms:
DA transporter SC6A3_RAT Sodium-dependent dopamine transporter | Sodium-dependent dopamine transporter (DAT)
Type:
Multi-pass membrane protein
Mol. Mass.:
68749.45
Organism:
Rattus norvegicus (rat)
Description:
P23977
Residue:
619
  
Inhibitor
Name:
BDBM50114074
Synonyms:
CHEMBL3603955
Type:
Small organic molecule
Emp. Form.:
C12H17NO2
Mol. Mass.:
207.2689
SMILES:
CN[C@@H](C)Cc1ccc2OCCOc2c1
: