Target
Cytochrome P450 2C9
Ligand
BDBM50114568
Substrate
Meas. Tech.
ChEMBL_1513823 (CHEMBL3611141)
EC50
660±n/a nM
Citation
 Bae, IHKim, HSYou, YChough, CChoe, WSeon, MKLee, SGKeum, GJang, SKMoon Kim, B Novel benzidine and diaminofluorene prolinamide derivatives as potent hepatitis C virus NS5A inhibitors. Eur J Med Chem 101:163-78 (2015)  
Target
Name:
Cytochrome P450 2C9
Synonyms:
(R)-limonene 6-monooxygenase CP2C9_HUMAN CYP2C9 Cytochrome P450 2C9 (CYP2C9 ) P-450MP P450 PB-1 | S-mephenytoin 4-hydroxylase
Type:
Enzyme
Mol. Mass.:
55636.33
Organism:
Homo sapiens (Human)
Description:
P11712
Residue:
490
  
Inhibitor
Name:
BDBM50114568
Synonyms:
CHEMBL3608913
Type:
Small organic molecule
Emp. Form.:
C44H42F6N6O8
Mol. Mass.:
896.8301
SMILES:
COC(=O)N[C@@H](C(=O)N1CCC[C@H]1C(=O)Nc1ccc(-c2ccc(NC(=O)[C@@H]3CCCN3C(=O)[C@H](NC(=O)OC)c3ccccc3)cc2C(F)(F)F)c(c1)C(F)(F)F)c1ccccc1
: