Target
Cytochrome P450 2C9
Ligand
BDBM50114572
Substrate
Meas. Tech.
ChEMBL_1513823 (CHEMBL3611141)
EC50
116±n/a nM
Citation
 Bae, IHKim, HSYou, YChough, CChoe, WSeon, MKLee, SGKeum, GJang, SKMoon Kim, B Novel benzidine and diaminofluorene prolinamide derivatives as potent hepatitis C virus NS5A inhibitors. Eur J Med Chem 101:163-78 (2015)  
Target
Name:
Cytochrome P450 2C9
Synonyms:
(R)-limonene 6-monooxygenase CP2C9_HUMAN CYP2C9 Cytochrome P450 2C9 (CYP2C9 ) P-450MP P450 PB-1 | S-mephenytoin 4-hydroxylase
Type:
Enzyme
Mol. Mass.:
55636.33
Organism:
Homo sapiens (Human)
Description:
P11712
Residue:
490
  
Inhibitor
Name:
BDBM50114572
Synonyms:
CHEMBL3608916
Type:
Small organic molecule
Emp. Form.:
C42H42Cl2N6O8
Mol. Mass.:
829.724
SMILES:
COC(=O)N[C@@H](C(=O)N1CCC[C@H]1C(=O)Nc1ccc(c(Cl)c1)-c1ccc(NC(=O)[C@@H]2CCCN2C(=O)[C@H](NC(=O)OC)c2ccccc2)cc1Cl)c1ccccc1
: