Target
Cytochrome P450 2D6
Ligand
BDBM50114573
Substrate
Meas. Tech.
ChEMBL_1513824 (CHEMBL3611142)
EC50
>100000±n/a nM
Citation
 Bae, IHKim, HSYou, YChough, CChoe, WSeon, MKLee, SGKeum, GJang, SKMoon Kim, B Novel benzidine and diaminofluorene prolinamide derivatives as potent hepatitis C virus NS5A inhibitors. Eur J Med Chem 101:163-78 (2015)  
Target
Name:
Cytochrome P450 2D6
Synonyms:
CP2D6_HUMAN CYP2DL1 Cytochrome P450 2D6 (CYP2D6) P450-DB1
Type:
Protein
Mol. Mass.:
55774.82
Organism:
Homo sapiens (Human)
Description:
P10635
Residue:
497
  
Inhibitor
Name:
BDBM50114573
Synonyms:
CHEMBL3608920
Type:
Small organic molecule
Emp. Form.:
C45H48N6O8
Mol. Mass.:
800.898
SMILES:
COC(=O)N[C@@H](C(=O)N1CCC[C@H]1C(=O)Nc1ccc2-c3ccc(NC(=O)[C@@H]4CCCN4C(=O)[C@H](NC(=O)OC)c4ccccc4)cc3C(C)(C)c2c1)c1ccccc1
: