Target
Cytochrome P450 3A4
Ligand
BDBM50114571
Substrate
Meas. Tech.
ChEMBL_1513826 (CHEMBL3611144)
EC50
2460±n/a nM
Citation
 Bae, IHKim, HSYou, YChough, CChoe, WSeon, MKLee, SGKeum, GJang, SKMoon Kim, B Novel benzidine and diaminofluorene prolinamide derivatives as potent hepatitis C virus NS5A inhibitors. Eur J Med Chem 101:163-78 (2015)  
Target
Name:
Cytochrome P450 3A4
Synonyms:
Albendazole monooxygenase CP3A4_HUMAN CYP3A4 CYPIIIA4 Cytochrome P450 3A4 (CYP3A4) Nifedipine oxidase Taurochenodeoxycholate 6-alpha-hydroxylase
Type:
Enzyme
Mol. Mass.:
57349.57
Organism:
Homo sapiens (Human)
Description:
Residue:
503
  
Inhibitor
Name:
BDBM50114571
Synonyms:
CHEMBL3608915
Type:
Small organic molecule
Emp. Form.:
C42H42F2N6O8
Mol. Mass.:
796.8151
SMILES:
COC(=O)N[C@@H](C(=O)N1CCC[C@H]1C(=O)Nc1ccc(c(F)c1)-c1ccc(NC(=O)[C@@H]2CCCN2C(=O)[C@H](NC(=O)OC)c2ccccc2)cc1F)c1ccccc1
: