Target
Carbonic anhydrase 2
Ligand
BDBM50114861
Substrate
Meas. Tech.
ChEMBL_1512514 (CHEMBL3610378)
Ki
0.009000±n/a nM
Citation
 Krasavin, MKorsakov, MDorogov, MTuccinardi, TDedeoglu, NSupuran, CT Probing the 'bipolar' nature of the carbonic anhydrase active site: aromatic sulfonamides containing 1,3-oxazol-5-yl moiety as picomolar inhibitors of cytosolic CA I and CA II isoforms. Eur J Med Chem 101:334-47 (2015)  
Target
Name:
Carbonic anhydrase 2
Synonyms:
CA-II CAC Carbonate dehydratase II Carbonic anhydrase 2 (CA-II) Carbonic anhydrase C Carbonic anhydrase II (CA-II) Carbonic anhydrase II (hCA II) | Carbonic anhydrase isoenzyme II (hCA II)
Type:
Enzyme
Mol. Mass.:
29250.71
Organism:
Homo sapiens (Human)
Description:
P00918
Residue:
260
  
Inhibitor
Name:
BDBM50114861
Synonyms:
CHEMBL3608873
Type:
Small organic molecule
Emp. Form.:
C14H15N3O4S
Mol. Mass.:
321.352
SMILES:
NS(=O)(=O)c1ccc(cc1)-c1cnc(o1)C(=O)N1CCCC1
: