Target
Alpha-1A adrenergic receptor
Ligand
BDBM50115122
Substrate
Meas. Tech.
ChEMBL_1513483 (CHEMBL3611839)
Ki
24±n/a nM
Citation
 Hayashi, ROhmori, EMoriwaki, MKumagai, HIsogaya, M Indolylpiperidine derivatives as potent and selectivea1B adrenoceptor antagonists. Bioorg Med Chem Lett 25:3921-3 (2015)  
Target
Name:
Alpha-1A adrenergic receptor
Synonyms:
ADA1A_RAT Adra1c Alpha-1A adrenoceptor Alpha-1C adrenergic receptor | adrenergic Alpha1A
Type:
Protein
Mol. Mass.:
51620.15
Organism:
Rattus norvegicus (Rat)
Description:
P43140
Residue:
466
  
Inhibitor
Name:
BDBM50115122
Synonyms:
CHEMBL3609360
Type:
Small organic molecule
Emp. Form.:
C25H30FN3
Mol. Mass.:
391.5242
SMILES:
Fc1ccc2c(c[nH]c2c1)C1CCN(CCCN2CCc3ccccc3C2)CC1
: