Target
Neuronal acetylcholine receptor subunit alpha-7
Ligand
BDBM82070
Substrate
Meas. Tech.
ChEMBL_1514955 (CHEMBL3615821)
Ki
250±n/a nM
Citation
 Matera, CPucci, LFiorentini, CFucile, SMissale, CGrazioso, GClementi, FZoli, MDe Amici, MGotti, CDallanoce, C Bifunctional compounds targeting both D2 and non-a7 nACh receptors: design, synthesis and pharmacological characterization. Eur J Med Chem 101:367-83 (2015)  
Target
Name:
Neuronal acetylcholine receptor subunit alpha-7
Synonyms:
ACHA7_RAT Cholinergic, Nicotinic Alpha7 Chrna7 Neuronal acetylcholine receptor (alpha7 nAChR) Neuronal acetylcholine receptor subunit alpha-7 Neuronal acetylcholine receptor subunit alpha-7 (nAChR)
Type:
Enzyme
Mol. Mass.:
56502.44
Organism:
Rattus norvegicus (Rat)
Description:
Q05941
Residue:
502
  
Inhibitor
Name:
BDBM82070
Synonyms:
CAS_29790-52-1 Nicotine-D salicylate US9303017, Nicotine
Type:
Emp. Form.:
C10H14N2
Mol. Mass.:
162.2316
SMILES:
CN1CCC[C@H]1c1cccnc1
: