Target
Cytochrome P450 3A4
Ligand
BDBM8610
Substrate
Meas. Tech.
ChEMBL_1515918 (CHEMBL3614896)
IC50
0.180000±n/a nM
Citation
 Roman, BIDe Ryck, TPatronov, ASlavov, SHVanhoecke, BWKatritzky, ARBracke, MEStevens, CV 4-Fluoro-3',4',5'-trimethoxychalcone as a new anti-invasive agent. From discovery to initial validation in an in vivo metastasis model. Eur J Med Chem 101:627-39 (2015)  
Target
Name:
Cytochrome P450 3A4
Synonyms:
Albendazole monooxygenase CP3A4_HUMAN CYP3A4 CYPIIIA4 Cytochrome P450 3A4 (CYP3A4) Nifedipine oxidase Taurochenodeoxycholate 6-alpha-hydroxylase
Type:
Enzyme
Mol. Mass.:
57349.57
Organism:
Homo sapiens (Human)
Description:
Residue:
503
  
Inhibitor
Name:
BDBM8610
Synonyms:
1-[4-(4-{[(2R,4S)-2-(2,4-dichlorophenyl)-2-(1H-imidazol-1-ylmethyl)-1,3-dioxolan-4-yl]methoxy}phenyl)piperazin-1-yl]ethan-1-one CHEMBL75 Ketoconazole US9138393, Ketoconozole | US9144538, Ketoconozole
Type:
Small organic molecule
Emp. Form.:
C26H28Cl2N4O4
Mol. Mass.:
531.431
SMILES:
[H][C@]1(COc2ccc(cc2)N2CCN(CC2)C(C)=O)CO[C@@](Cn2ccnc2)(O1)c1ccc(Cl)cc1Cl
: