Target
Non-receptor tyrosine-protein kinase TYK2
Ligand
BDBM50117298
Substrate
Meas. Tech.
ChEMBL_1514373 (CHEMBL3615452)
IC50
10.0±n/a nM
Citation
 Jang, WDKim, JTSon, HYPark, SYCho, YSKoo, TSLee, HKang, NS Discovery of Tyk2 inhibitors via the virtual site-directed fragment-based drug design. Bioorg Med Chem Lett 25:3947-52 (2015)  
Target
Name:
Non-receptor tyrosine-protein kinase TYK2
Synonyms:
Non-receptor tyrosine-protein kinase TYK2 (TYK2) TYK2_HUMAN | Tyrosine-protein kinase TYK2
Type:
Protein
Mol. Mass.:
133666.03
Organism:
Homo sapiens (Human)
Description:
P29597
Residue:
1187
  
Inhibitor
Name:
BDBM50117298
Synonyms:
CHEMBL3613597
Type:
Small organic molecule
Emp. Form.:
C23H27BrN8
Mol. Mass.:
495.418
SMILES:
CC(C)c1nn(C)cc1-c1nc2c(N3CCN(Cc4cccnc4)CC3)c(Br)cnc2[nH]1
: