Target
LIM domain kinase 1
Ligand
BDBM50117302
Substrate
Meas. Tech.
ChEMBL_1514397 (CHEMBL3615476)
IC50
37±n/a nM
Citation
 Boland, SBourin, AAlen, JGeraets, JSchroeders, PCastermans, KKindt, NBoumans, NPanitti, LVanormelingen, JFransen, SVan de Velde, SDefert, O Design, synthesis and biological characterization of selective LIMK inhibitors. Bioorg Med Chem Lett 25:4005-10 (2015)  
Target
Name:
LIM domain kinase 1
Synonyms:
LIMK LIMK1 | LIMK1_HUMAN
Type:
Enzyme Catalytic Domain
Mol. Mass.:
72591.81
Organism:
Homo sapiens (Human)
Description:
gi_4505001
Residue:
647
  
Inhibitor
Name:
BDBM50117302
Synonyms:
CHEMBL3613602
Type:
Small organic molecule
Emp. Form.:
C23H28N6O3
Mol. Mass.:
436.5068
SMILES:
COC(=O)c1cccc(NC(=O)C2(CCN(CC2)c2ncnc3[nH]cc(C)c23)N(C)C)c1
: