Target
cAMP-dependent protein kinase catalytic subunit alpha/beta/gamma
Ligand
BDBM50117302
Substrate
Meas. Tech.
ChEMBL_1514400 (CHEMBL3615479)
IC50
150±n/a nM
Citation
 Boland, SBourin, AAlen, JGeraets, JSchroeders, PCastermans, KKindt, NBoumans, NPanitti, LVanormelingen, JFransen, SVan de Velde, SDefert, O Design, synthesis and biological characterization of selective LIMK inhibitors. Bioorg Med Chem Lett 25:4005-10 (2015)  
Target
Name:
cAMP-dependent protein kinase catalytic subunit alpha/beta/gamma
Synonyms:
cAMP-dependent protein kinase (PKA)
Type:
Mol. Mass.:
Description:
ASSAY_ID of ChEMBL is 217489
Components:
This complex has 3 components.
Component 1
Name:
cAMP-dependent protein kinase catalytic subunit beta
Synonyms:
KAPCB_HUMAN PKAC-beta cAMP-dependent protein kinase (PKA) cAMP-dependent protein kinase catalytic subunit beta
Type:
PROTEIN
Mol. Mass.:
40631.25
Organism:
Homo sapiens (Human)
Description:
ChEMBL_586348
Residue:
351
  
Component 2
Name:
cAMP-dependent protein kinase catalytic subunit alpha
Synonyms:
KAPCA_HUMAN PKACA cAMP-dependent protein kinase (PKA) cAMP-dependent protein kinase catalytic subunit alpha cAMP-dependent protein kinase catalytic subunit alpha (PKACA) cAMP-dependent protein kinase catalytic subunit alpha isoform 1 | cAMP-dependent protein kinase, alpha-catalytic subunit
Type:
Enzyme Catalytic Subunit
Mol. Mass.:
40598.73
Organism:
Homo sapiens (Human)
Description:
Residue:
351
  
Component 3
Name:
cAMP-dependent protein kinase catalytic subunit gamma
Synonyms:
KAPCG_HUMAN PRKACG cAMP-dependent protein kinase catalytic subunit gamma
Type:
PROTEIN
Mol. Mass.:
40442.03
Organism:
Homo sapiens (Human)
Description:
ChEMBL_104720
Residue:
351
  
Inhibitor
Name:
BDBM50117302
Synonyms:
CHEMBL3613602
Type:
Small organic molecule
Emp. Form.:
C23H28N6O3
Mol. Mass.:
436.5068
SMILES:
COC(=O)c1cccc(NC(=O)C2(CCN(CC2)c2ncnc3[nH]cc(C)c23)N(C)C)c1
: