Target
Rho-associated protein kinase 2
Ligand
BDBM50117629
Substrate
Meas. Tech.
ChEMBL_1514399 (CHEMBL3615478)
IC50
11±n/a nM
Citation
 Boland, SBourin, AAlen, JGeraets, JSchroeders, PCastermans, KKindt, NBoumans, NPanitti, LVanormelingen, JFransen, SVan de Velde, SDefert, O Design, synthesis and biological characterization of selective LIMK inhibitors. Bioorg Med Chem Lett 25:4005-10 (2015)  
Target
Name:
Rho-associated protein kinase 2
Synonyms:
KIAA0619 ROCK2 Rho kinase 2 (ROCKII) Rho-associated protein kinase 2 (ROCK2) Rho-associated protein kinase 2/Transforming protein RhoA Rho-associated, coiled-coil-containing protein kinase II p164 ROCK-2
Type:
Protein
Mol. Mass.:
160885.43
Organism:
Homo sapiens (Human)
Description:
O75116
Residue:
1388
  
Inhibitor
Name:
BDBM50117629
Synonyms:
CHEMBL3613612
Type:
Small organic molecule
Emp. Form.:
C23H28N6O3
Mol. Mass.:
436.5068
SMILES:
COC(=O)c1cccc(NC(=O)C2(CN(C)C)CCN(CC2)c2ccnc3[nH]ncc23)c1
: