Target
Epidermal growth factor receptor
Ligand
BDBM50122566
Substrate
Meas. Tech.
ChEMBL_1515019 (CHEMBL3616083)
IC50
250±n/a nM
Citation
 Ibrahim, DAAbou El Ella, DAEl-Motwally, AMAly, RM Molecular design and synthesis of certain new quinoline derivatives having potential anticancer activity. Eur J Med Chem 102:115-31 (2015)  
Target
Name:
Epidermal growth factor receptor
Synonyms:
EGF Receptor Substrate EGFR_HUMAN ERBB1 Epidermal Growth Factor Receptor erbB-1 Epidermal growth factor receptor (EGFR) HER1 Proto-oncogene c-ErbB-1 Tyrosine-Protein Kinase ErbB-1
Type:
Receptor Kinase Domain
Mol. Mass.:
134279.59
Organism:
Homo sapiens (Human)
Description:
P00533
Residue:
1210
  
Inhibitor
Name:
BDBM50122566
Synonyms:
4-Diisopropylamino-but-2-ynoic acid [4-(3-bromo-phenylamino)-3-cyano-quinolin-6-yl]-amide | CHEMBL113900
Type:
Small organic molecule
Emp. Form.:
C26H26BrN5O
Mol. Mass.:
504.422
SMILES:
CC(C)N(CC#CC(=O)Nc1ccc2ncc(C#N)c(Nc3cccc(Br)c3)c2c1)C(C)C
: