Target
Menin
Ligand
BDBM50117744
Substrate
Meas. Tech.
ChEMBL_1515211 (CHEMBL3614558)
IC50
65±n/a nM
Citation
 Pollock, JBorkin, DLund, GPurohit, TDyguda-Kazimierowicz, EGrembecka, JCierpicki, T Rational Design of Orthogonal Multipolar Interactions with Fluorine in Protein-Ligand Complexes. J Med Chem 58:7465-74 (2015)  
Target
Name:
Menin
Synonyms:
MEN1 Menin/Histone-lysine N-methyltransferase MLL | SCG2
Type:
Protein
Mol. Mass.:
68022.55
Organism:
Homo sapiens (Human)
Description:
O00255
Residue:
615
  
Inhibitor
Name:
BDBM50117744
Synonyms:
CHEMBL3613789
Type:
Small organic molecule
Emp. Form.:
C17H21F2N5S2
Mol. Mass.:
397.509
SMILES:
CC1(C)CN=C(S1)N1CCN(CC1)c1ncnc2sc(CC(F)F)cc12
: