Target
Carbonic anhydrase 12
Ligand
BDBM50030564
Substrate
Meas. Tech.
ChEMBL_1516092 (CHEMBL3615735)
Ki
6.0±n/a nM
Citation
 Bragagni, MBozdag, MCarta, FScozzafava, ALanzi, CMasini, EMura, PSupuran, CT Cyclodextrin complexation highly enhances efficacy of arylsulfonylureido benzenesulfonamide carbonic anhydrase inhibitors as a topical antiglaucoma agents. Bioorg Med Chem 23:6223-7 (2015)  
Target
Name:
Carbonic anhydrase 12
Synonyms:
CA-XII CAH12_HUMAN Carbonic anhydrase Carbonic anhydrase XII Carbonic anhydrase XII (CAXII) | Tumor antigen HOM-RCC-3.1.3
Type:
Enzyme
Mol. Mass.:
39456.00
Organism:
Homo sapiens (Human)
Description:
Catalytic domain of human cloned isozyme was used in the assay
Residue:
354
  
Inhibitor
Name:
BDBM50030564
Synonyms:
CHEMBL3354132
Type:
Small organic molecule
Emp. Form.:
C16H19N3O5S2
Mol. Mass.:
397.469
SMILES:
Cc1ccc(cc1)S(=O)(=O)NC(=O)NCCc1ccc(cc1)S(N)(=O)=O
: