Target
Kappa-type opioid receptor
Ligand
BDBM50118183
Substrate
Meas. Tech.
ChEMBL_1514758 (CHEMBL3614959)
Ki
0.470000±n/a nM
Citation
 Nakajima, RYamamoto, NHirayama, SIwai, TSaitoh, ANagumo, YFujii, HNagase, H Synthesis of new opioid derivatives with a propellane skeleton and their pharmacologies: Part 5, novel pentacyclic propellane derivatives with a 6-amide side chain. Bioorg Med Chem 23:6271-9 (2015)  
Target
Name:
Kappa-type opioid receptor
Synonyms:
KOR-1 OPIATE Kappa Oprk1
Type:
Enzyme
Mol. Mass.:
42656.78
Organism:
Mus musculus (Mouse)
Description:
P33534
Residue:
380
  
Inhibitor
Name:
BDBM50118183
Synonyms:
CHEMBL3613164
Type:
Small organic molecule
Emp. Form.:
C32H39ClN2O2
Mol. Mass.:
519.117
SMILES:
Cl.[H][C@]12C[C@@]34Cc5ccc(O)cc5[C@@]3(CCN(CC3CC3)[C@@]4([H])C=C1)C[C@H]2N(C)C(=O)CCc1ccccc1
: