Target
Receptor-type tyrosine-protein kinase FLT3
Ligand
BDBM50118378
Substrate
Meas. Tech.
ChEMBL_1514895 (CHEMBL3615646)
IC50
0.123000±n/a nM
Citation
 Phillipson, LJSegal, DHNero, TLParker, MWWan, SSde Silva, MGuthridge, MAWei, AHBurns, CJ Discovery and SAR of novel pyrazolo[1,5-a]pyrimidines as inhibitors of CDK9. Bioorg Med Chem 23:6280-96 (2015)  
Target
Name:
Receptor-type tyrosine-protein kinase FLT3
Synonyms:
CD135 FL cytokine receptor FLK2 FLT3 Fetal liver kinase-2 Fms-like tyrosine kinase 3 (Flt-3) STK-1 Stem cell tyrosine kinase 1
Type:
Enzyme
Mol. Mass.:
112888.62
Organism:
Homo sapiens (Human)
Description:
P36888
Residue:
993
  
Inhibitor
Name:
BDBM50118378
Synonyms:
CHEMBL3612622
Type:
Small organic molecule
Emp. Form.:
C17H12ClN5O4S
Mol. Mass.:
417.826
SMILES:
Cc1ccc(cc1S(=O)(=O)n1ccc(c1)-c1cnn2ccc(Cl)nc12)[N+]([O-])=O
: