Target
Interstitial collagenase
Ligand
BDBM50119282
Substrate
Meas. Tech.
ChEMBL_1518236 (CHEMBL3619994)
IC50
660±n/a nM
Citation
 Nuti, ECantelmo, ARGallo, CBruno, ABassani, BCamodeca, CTuccinardi, TVera, LOrlandini, ENencetti, SStura, EAMartinelli, ADive, VAlbini, ARossello, A N-O-Isopropyl Sulfonamido-Based Hydroxamates as Matrix Metalloproteinase Inhibitors: Hit Selection and in Vivo Antiangiogenic Activity. J Med Chem 58:7224-40 (2015)  
Target
Name:
Interstitial collagenase
Synonyms:
CLG MMP1 Matrix metalloproteinase-1 | Matrix metalloproteinase-1 (MMP-1)
Type:
Enzyme
Mol. Mass.:
54010.26
Organism:
Homo sapiens (Human)
Description:
P03956
Residue:
469
  
Inhibitor
Name:
BDBM50119282
Synonyms:
CHEMBL3617404
Type:
Small organic molecule
Emp. Form.:
C22H29N3O7S
Mol. Mass.:
479.547
SMILES:
COc1ccc(cc1)-c1ccc(cc1)S(=O)(=O)N(OC(C)C)[C@H](CCNC(C)=O)C(=O)NO
: