Target
Proteasome subunit beta type-5
Ligand
BDBM50119295
Substrate
Meas. Tech.
ChEMBL_1515347 (CHEMBL3615140)
Ki
7575±n/a nM
Citation
 Totaro, KABarthelme, DSimpson, PTSauer, RTSello, JK Substrate-guided optimization of the syringolins yields potent proteasome inhibitors with activity against leukemia cell lines. Bioorg Med Chem 23:6218-22 (2015)  
Target
Name:
Proteasome subunit beta type-5
Synonyms:
20S proteasome chymotrypsin-like LMPX PSB5_HUMAN Proteasome Macropain subunit MB1 X
Type:
Protein
Mol. Mass.:
28480.96
Organism:
Homo sapiens (Human)
Description:
Residue:
263
  
Inhibitor
Name:
BDBM50119295
Synonyms:
CHEMBL3613815
Type:
Small organic molecule
Emp. Form.:
C30H42F3N5O6
Mol. Mass.:
625.6796
SMILES:
COC(=O)[C@@H](NC(=O)N[C@@H](C(C)C)C(=O)N[C@H]1CCCCNC(=O)\C=C\[C@H](Cc2cccc(c2)C(F)(F)F)NC1=O)C(C)C
: