Target
Glucagon receptor
Ligand
BDBM50119555
Substrate
Meas. Tech.
ChEMBL_1518547 (CHEMBL3619086)
Ki
15±n/a nM
Citation
 Sammons, MFLee, EC Recent progress in the development of small-molecule glucagon receptor antagonists. Bioorg Med Chem Lett 25:4057-64 (2015)  
Target
Name:
Glucagon receptor
Synonyms:
GCGR GLR_HUMAN Glucagon receptor (GlucR)
Type:
Enzyme
Mol. Mass.:
54026.92
Organism:
Homo sapiens (Human)
Description:
P47871
Residue:
477
  
Inhibitor
Name:
BDBM50119555
Synonyms:
CHEMBL3617571
Type:
Small organic molecule
Emp. Form.:
C25H26F3N5O3
Mol. Mass.:
501.5008
SMILES:
CC(C)C[C@H](Nc1ccc(cn1)C(=O)NCCC(O)=O)c1cnc(nc1)-c1ccc(cc1)C(F)(F)F
: