Target
Mitogen-activated protein kinase 3
Ligand
BDBM50094464
Substrate
Meas. Tech.
ChEMBL_1517782 (CHEMBL3620378)
IC50
4.0±n/a nM
Citation
 Uehling, DEHarris, PA Recent progress on MAP kinase pathway inhibitors. Bioorg Med Chem Lett 25:4047-56 (2015)  
Target
Name:
Mitogen-activated protein kinase 3
Synonyms:
ERK1 Extracellular signal-regulated kinase 1 MAP kinase ERK1 MAPK3/MAPK7 Mitogen-activated protein kinase PRKM3
Type:
Protein
Mol. Mass.:
43136.58
Organism:
Homo sapiens (Human)
Description:
curated by PDB 4QTB
Residue:
379
  
Inhibitor
Name:
BDBM50094464
Synonyms:
CHEMBL3590107 US10934304, Example SCH772984
Type:
Small organic molecule
Emp. Form.:
C33H33N9O2
Mol. Mass.:
587.6742
SMILES:
O=C(CN1CC[C@H](C1)C(=O)Nc1ccc2[nH]nc(-c3ccncc3)c2c1)N1CCN(CC1)c1ccc(cc1)-c1ncccn1
: