Target
Muscarinic acetylcholine receptor M2
Ligand
BDBM50119644
Substrate
Meas. Tech.
ChEMBL_1517984 (CHEMBL3618841)
EC50
65±n/a nM
Citation
 Liu, BCroy, CHHitchcock, SAAllen, JRRao, ZEvans, DBures, MGMcKinzie, DLWatt, MLStuart Gregory, GHansen, MMHoogestraat, PJJamison, JAOkha-Mokube, FMStratford, RETurner, WBymaster, FFelder, CC Design and synthesis of N-[6-(Substituted Aminoethylideneamino)-2-Hydroxyindan-1-yl]arylamides as selective and potent muscarinic M1 agonists. Bioorg Med Chem Lett 25:4158-63 (2015)  
Target
Name:
Muscarinic acetylcholine receptor M2
Synonyms:
ACM2_HUMAN Cholinergic, muscarinic M2 Muscarinic acetylcholine receptor M2 and M5 | RecName: Full=Muscarinic acetylcholine receptor M2
Type:
GPCR
Mol. Mass.:
51730.61
Organism:
Homo sapiens (Human)
Description:
P08172
Residue:
466
  
Inhibitor
Name:
BDBM50119644
Synonyms:
CHEMBL3616499
Type:
Small organic molecule
Emp. Form.:
C27H28FN3O2
Mol. Mass.:
445.5285
SMILES:
CN(Cc1ccc(F)cc1)C(\C)=N\c1ccc2C[C@@H](O)[C@H](NC(=O)c3ccc(C)cc3)c2c1
: