Target
Muscarinic acetylcholine receptor M2
Ligand
BDBM50038210
Substrate
Meas. Tech.
ChEMBL_1517984 (CHEMBL3618841)
EC50
296±n/a nM
Citation
 Liu, BCroy, CHHitchcock, SAAllen, JRRao, ZEvans, DBures, MGMcKinzie, DLWatt, MLStuart Gregory, GHansen, MMHoogestraat, PJJamison, JAOkha-Mokube, FMStratford, RETurner, WBymaster, FFelder, CC Design and synthesis of N-[6-(Substituted Aminoethylideneamino)-2-Hydroxyindan-1-yl]arylamides as selective and potent muscarinic M1 agonists. Bioorg Med Chem Lett 25:4158-63 (2015)  
Target
Name:
Muscarinic acetylcholine receptor M2
Synonyms:
ACM2_HUMAN Cholinergic, muscarinic M2 Muscarinic acetylcholine receptor M2 and M5 | RecName: Full=Muscarinic acetylcholine receptor M2
Type:
GPCR
Mol. Mass.:
51730.61
Organism:
Homo sapiens (Human)
Description:
P08172
Residue:
466
  
Inhibitor
Name:
BDBM50038210
Synonyms:
5-(2-Ethyl-2H-tetrazol-5-yl)-1-methyl-1,2,3,6-tetrahydro-pyridine CHEMBL131428
Type:
Small organic molecule
Emp. Form.:
C9H15N5
Mol. Mass.:
193.2489
SMILES:
CCn1nnc(n1)C1=CCCN(C)C1
: