Target
11-beta-hydroxysteroid dehydrogenase 1
Ligand
BDBM50120378
Substrate
Meas. Tech.
ChEMBL_1518302 (CHEMBL3620277)
IC50
74±n/a nM
Citation
 Leiva, RSeira, CMcBride, ABinnie, MLuque, FJBidon-Chanal, AWebster, SPVázquez, S Novel 11ß-HSD1 inhibitors: C-1 versus C-2 substitution and effect of the introduction of an oxygen atom in the adamantane scaffold. Bioorg Med Chem Lett 25:4250-3 (2015)  
Target
Name:
11-beta-hydroxysteroid dehydrogenase 1
Synonyms:
11-DH 11-beta-Hydroxysteroid Dehydrogenase 1 (11-beta-HSD1) 11-beta-hydroxysteroid dehydrogenase 1 (11HSD1) Corticosteroid 11-beta-dehydrogenase isozyme 1 (11-beta-HSD-1) Corticosteroid 11-beta-dehydrogenase isozyme 1 (11beta-HSD1) HSD11 HSD11L | SDR26C1
Type:
Enzyme
Mol. Mass.:
32409.16
Organism:
Homo sapiens (Human)
Description:
P28845
Residue:
292
  
Inhibitor
Name:
BDBM50120378
Synonyms:
CHEMBL3616709
Type:
Small organic molecule
Emp. Form.:
C17H20Cl2N2O
Mol. Mass.:
339.259
SMILES:
Nc1c(Cl)cc(cc1Cl)C(=O)NC1C2CC3CC(C2)CC1C3
: