Target
Alpha-amylase 1A
Ligand
BDBM50120835
Substrate
Meas. Tech.
ChEMBL_1516310 (CHEMBL3618750)
IC50
62000±n/a nM
Citation
 Al-Asri, JFazekas, ELehoczki, GPerdih, AGörick, CMelzig, MFGyémánt, GWolber, GMortier, J From carbohydrates to drug-like fragments: Rational development of novela-amylase inhibitors. Bioorg Med Chem 23:6725-32 (2015)  
Target
Name:
Alpha-amylase 1A
Synonyms:
1,4-alpha-D-glucan glucanohydrolase 1 AMY1A Alpha-amylase | Salivary alpha-amylase
Type:
Glycosidase
Mol. Mass.:
57770.18
Organism:
Homo sapiens (Human)
Description:
Purchased from Sigma Chemical Co.
Residue:
511
  
Inhibitor
Name:
BDBM50120835
Synonyms:
CHEMBL2011401
Type:
Small organic molecule
Emp. Form.:
C17H11NO4S2
Mol. Mass.:
357.404
SMILES:
OC(=O)c1cccc(c1)N1C(=S)S\C(=C/c2ccccc2O)C1=O
: