Target
Alpha-amylase 1A
Ligand
BDBM50293577
Substrate
Meas. Tech.
ChEMBL_1516310 (CHEMBL3618750)
IC50
492000±n/a nM
Citation
 Al-Asri, JFazekas, ELehoczki, GPerdih, AGörick, CMelzig, MFGyémánt, GWolber, GMortier, J From carbohydrates to drug-like fragments: Rational development of novela-amylase inhibitors. Bioorg Med Chem 23:6725-32 (2015)  
Target
Name:
Alpha-amylase 1A
Synonyms:
1,4-alpha-D-glucan glucanohydrolase 1 AMY1A Alpha-amylase | Salivary alpha-amylase
Type:
Glycosidase
Mol. Mass.:
57770.18
Organism:
Homo sapiens (Human)
Description:
Purchased from Sigma Chemical Co.
Residue:
511
  
Inhibitor
Name:
BDBM50293577
Synonyms:
4-(4-(4-Hydroxyphenyl)thiazol-2-ylamino)phenol cid_972292
Type:
Small organic molecule
Emp. Form.:
C15H12N2O2S
Mol. Mass.:
284.333
SMILES:
Oc1ccc(Nc2nc(cs2)-c2ccc(O)cc2)cc1
: