Target
Steryl-sulfatase
Ligand
BDBM50121079
Substrate
Meas. Tech.
ChEMBL_1521502 (CHEMBL3627340)
IC50
205±n/a nM
Citation
 Thomas, MPPotter, BV Discovery and Development of the Aryl O-Sulfamate Pharmacophore for Oncology and Women's Health. J Med Chem 58:7634-58 (2015)  
Target
Name:
Steryl-sulfatase
Synonyms:
ARSC1 Arylsulfatase C STS_HUMAN Steryl-sulfate sulfohydrolase
Type:
Enzyme
Mol. Mass.:
65503.66
Organism:
Homo sapiens (Human)
Description:
P08842
Residue:
583
  
Inhibitor
Name:
BDBM50121079
Synonyms:
CHEMBL3622064
Type:
Small organic molecule
Emp. Form.:
C20H15BrN6O3S
Mol. Mass.:
499.34
SMILES:
NS(=O)(=O)Oc1ccc2cc(CN(c3ccc(cc3)C#N)n3cnnc3)ccc2c1Br
: