Target
Aromatase
Ligand
BDBM50121075
Substrate
Meas. Tech.
ChEMBL_1521503 (CHEMBL3627341)
IC50
0.510000±n/a nM
Citation
 Thomas, MPPotter, BV Discovery and Development of the Aryl O-Sulfamate Pharmacophore for Oncology and Women's Health. J Med Chem 58:7634-58 (2015)  
Target
Name:
Aromatase
Synonyms:
ARO1 CP19A_HUMAN CYP19 CYPXIX Cytochrome P450 19A1 Cytochrome P450-C19 (CYP19) FL cytokine receptor precursor | P-450AROM
Type:
Enzyme
Mol. Mass.:
57888.92
Organism:
Homo sapiens (Human)
Description:
P11511
Residue:
503
  
Inhibitor
Name:
BDBM50121075
Synonyms:
CHEMBL3622058
Type:
Small organic molecule
Emp. Form.:
C18H18N6O3S2
Mol. Mass.:
430.504
SMILES:
NS(=O)(=O)Oc1ccc(SCCCN(c2ccc(cc2)C#N)n2cnnc2)cc1
: