Target
Histamine H2 receptor
Ligand
BDBM50121205
Substrate
Meas. Tech.
ChEMBL_1521713 (CHEMBL3626536)
Ki
5000±n/a nM
Citation
 Tichenor, MSThurmond, RLVenable, JDSavall, BM Functional Profiling of 2-Aminopyrimidine Histamine H4 Receptor Modulators. J Med Chem 58:7119-27 (2015)  
Target
Name:
Histamine H2 receptor
Synonyms:
Gastric receptor I HISTAMINE H2 HRH2_HUMAN Histamine H2-Gs alpha S
Type:
G Protein-Coupled Receptor (GPCR)
Mol. Mass.:
40115.31
Organism:
Homo sapiens (Human)
Description:
Residue:
359
  
Inhibitor
Name:
BDBM50121205
Synonyms:
CHEBI:18295 | Histamine
Type:
Small organic molecule
Emp. Form.:
C5H9N3
Mol. Mass.:
111.1451
SMILES:
NCCc1c[nH]cn1
: