Target
ATP-sensitive inward rectifier potassium channel 1
Ligand
BDBM50121346
Substrate
Meas. Tech.
ChEMBL_1522251 (CHEMBL3626480)
IC50
13±n/a nM
Citation
 Blass, B Inhibitors of the Renal Outer Medullary Potassium Channel. ACS Med Chem Lett 6:831-3 (2015)  
Target
Name:
ATP-sensitive inward rectifier potassium channel 1
Synonyms:
ATP-regulated potassium channel ROM-K ATP-sensitive inward rectifier potassium channel 1 KCNJ1 Potassium channel (ATP modulatory) ROMK1 The Renal Outer Medullary Potassium (ROMK)
Type:
Enzyme Catalytic Domain
Mol. Mass.:
44809.08
Organism:
Homo sapiens (Human)
Description:
gi_223460826
Residue:
391
  
Inhibitor
Name:
BDBM50121346
Synonyms:
CHEMBL3622115
Type:
Small organic molecule
Emp. Form.:
C25H29N5O3
Mol. Mass.:
447.5295
SMILES:
Cc1c2COC(=O)c2ccc1[C@@H](O)CN1CCC2(CC1)CCN(CC2)c1ccc(nn1)C#N
: